{"text_format":"1","workbook":"xlsx","n_sheets":6,"sheets":["CP14.2025","Fornecedores","RefParts II","RefParts","Fornecedores II","Input"],"not_rendered":{"charts":0,"images":1,"macros":1,"external_links":0,"defined_names":1,"comments":0,"pivot_tables":0},"unopened":[],"bounds":{"document_bytes":16777216,"sheet_cells":100000,"rows_first":2000,"rows_last":500,"rows_between":2000,"halvings":0,"cell_chars":16384,"cell_head_chars":4096},"cells_cut":0,"cells_raw":0,"read":"whole","date_system":"1900"}

{"sheet":"CP14.2025","index":0,"n_rows":47,"n_cols":26,"rows_kept":47,"cut":false,"hidden":false,"merged":[[0,1,0,5],[0,6,0,13],[0,14,0,37]]}
[null,"Códigos dos artigos por empresa",null,null,null,null,"Condições a carregar no arcodo",null,null,null,null,null,null,null,"Outras ordens a criar nos artigos além da do acordo"]
["Descrição","BT","RL","EVA","RA","TEJO","FORNECEDOR","NIF","ordem","Marca","Referência","P Un","Data inicio","Data de fim","FORNECEDOR","NIF","ordem","Marca","Referência","P Un","FORNECEDOR","NIF","ordem","Marca","Referência","P Un"]
["AMORTECEDOR DIREÇÃO",null,"050230226",null,null,null,"CarClasse",{"$f":"INDEX(Fornecedores!$B$2:$B$24,MATCH('CP14.2025'!G3,Fornecedores!$A$2:$A$24,0))","v":503048852},31,"OMNIplus","A.628.460.00.66",125.16,"2026-01-05","2027-01-05","Sodicentro",{"$f":"INDEX(Fornecedores!$B$2:$B$24,MATCH('CP14.2025'!O3,Fornecedores!$A$2:$A$24,0))","v":501328459},32,"OMNIplus","A.628.460.00.66",131.69999999999999,"CIVIPARTS",{"$f":"INDEX(Fornecedores!$B$2:$B$24,MATCH('CP14.2025'!U3,Fornecedores!$A$2:$A$24,0))","v":503881317},33,"SAMPA","SAM-010.2135",149.87]
["AMORTECEDOR SUSP.FRENTE",null,"050430107",null,null,null,"EUROPART",{"$f":"INDEX(Fornecedores!$B$2:$B$24,MATCH('CP14.2025'!G4,Fornecedores!$A$2:$A$24,0))","v":503791970},31,"EUROPART","9200131828",41.53,"2026-01-05","2027-01-05","Folan",{"$f":"INDEX(Fornecedores!$B$2:$B$24,MATCH('CP14.2025'!O4,Fornecedores!$A$2:$A$24,0))","v":503679844},32,"MAYSAN","99225",67.5,"CIVIPARTS",{"$f":"INDEX(Fornecedores!$B$2:$B$24,MATCH('CP14.2025'!U4,Fornecedores!$A$2:$A$24,0))","v":503881317},33,"MONROE","MON-B5298",80.930000000000007]
["AMORTECEDOR SUSP.TRASEIRA","021430103",null,"021430046",null,null,"CIVIPARTS",{"$f":"INDEX(Fornecedores!$B$2:$B$24,MATCH('CP14.2025'!G5,Fornecedores!$A$2:$A$24,0))","v":503881317},31,"DT DIESEL","DTD-4.66580",26.19,"2026-01-05","2027-01-05","Folan",{"$f":"INDEX(Fornecedores!$B$2:$B$24,MATCH('CP14.2025'!O5,Fornecedores!$A$2:$A$24,0))","v":503679844},32,"MONROE","V1178",33,"CIVIPARTS",{"$f":"INDEX(Fornecedores!$B$2:$B$24,MATCH('CP14.2025'!U5,Fornecedores!$A$2:$A$24,0))","v":503881317},33,"SACHS","SAC-314606",34.31]
["AMORTECEDOR SUSP.TRASEIRA",null,null,"021410170",null,null,"CIVIPARTS",{"$f":"INDEX(Fornecedores!$B$2:$B$24,MATCH('CP14.2025'!G6,Fornecedores!$A$2:$A$24,0))","v":503881317},31,"DT DIESEL","DTD-4.66581",27.19,"2026-01-05","2027-01-05","Folan",{"$f":"INDEX(Fornecedores!$B$2:$B$24,MATCH('CP14.2025'!O6,Fornecedores!$A$2:$A$24,0))","v":503679844},32,"MONROE","V1178",33,"CIVIPARTS",{"$f":"INDEX(Fornecedores!$B$2:$B$24,MATCH('CP14.2025'!U6,Fornecedores!$A$2:$A$24,0))","v":503881317},33,"SACHS","SAC-314606",34.31]
["AMORTECEDOR DIREÇÃO","004572558",null,null,null,null,"Folan",{"$f":"INDEX(Fornecedores!$B$2:$B$24,MATCH('CP14.2025'!G7,Fornecedores!$A$2:$A$24,0))","v":503679844},31,"EASY-LIFT","3204",4.5,"2026-01-05","2027-01-05","Motorbus",{"$f":"INDEX(Fornecedores!$B$2:$B$24,MATCH('CP14.2025'!O7,Fornecedores!$A$2:$A$24,0))","v":503500992},32,"SAMPA","084,008-01",11.52,"CarClasse",{"$f":"INDEX(Fornecedores!$B$2:$B$24,MATCH('CP14.2025'!U7,Fornecedores!$A$2:$A$24,0))","v":503048852},33,"OMNIplus","8.233.190.000.0",16.21]
["AMORTECEDOR DIREÇÃO","028430023",null,null,null,null,"CarClasse",{"$f":"INDEX(Fornecedores!$B$2:$B$24,MATCH('CP14.2025'!G8,Fornecedores!$A$2:$A$24,0))","v":503048852},31,"OMNIplus","8.231.371.000.0",68.84,"2026-01-05","2027-01-05","Sodicentro",{"$f":"INDEX(Fornecedores!$B$2:$B$24,MATCH('CP14.2025'!O8,Fornecedores!$A$2:$A$24,0))","v":501328459},32,"OMNIplus","8.231.371.000.0",69.540000000000006,"CBM",{"$f":"INDEX(Fornecedores!$B$2:$B$24,MATCH('CP14.2025'!U8,Fornecedores!$A$2:$A$24,0))","v":"B85631083"},33,"var","d9597660",98.99]
["AMORTECEDOR DIREÇÃO","042430124",null,null,null,null,"NASACAR",{"$f":"INDEX(Fornecedores!$B$2:$B$24,MATCH('CP14.2025'!G9,Fornecedores!$A$2:$A$24,0))","v":500615250},31,"MONROE","B1351",35,"2026-01-05","2027-01-05","CIVIPARTS",{"$f":"INDEX(Fornecedores!$B$2:$B$24,MATCH('CP14.2025'!O9,Fornecedores!$A$2:$A$24,0))","v":503881317},32,"SACHS","SAC-290889",70.540000000000006,"Motorbus",{"$f":"INDEX(Fornecedores!$B$2:$B$24,MATCH('CP14.2025'!U9,Fornecedores!$A$2:$A$24,0))","v":503500992},33,"MONROE","B5290",71.040000000000006]
["AMORTECEDOR DIREÇÃO","004558128",null,null,null,null,"Folan",{"$f":"INDEX(Fornecedores!$B$2:$B$24,MATCH('CP14.2025'!G10,Fornecedores!$A$2:$A$24,0))","v":503679844},31,"EASY-LIFT","3585",6.3,"2026-01-05","2027-01-05","CBM",{"$f":"INDEX(Fornecedores!$B$2:$B$24,MATCH('CP14.2025'!O10,Fornecedores!$A$2:$A$24,0))","v":"B85631083"},32,"STABILUS","4534DS",8.77,"CarClasse",{"$f":"INDEX(Fornecedores!$B$2:$B$24,MATCH('CP14.2025'!U10,Fornecedores!$A$2:$A$24,0))","v":503048852},33,"OMNIplus","A.002.980.30.64",18.079999999999998]
["AMORTECEDOR DIREÇÃO",null,null,"021620133",null,null,"CarClasse",{"$f":"INDEX(Fornecedores!$B$2:$B$24,MATCH('CP14.2025'!G11,Fornecedores!$A$2:$A$24,0))","v":503048852},31,"OMNIplus","A.606.980.02.64",13.53,"2026-01-05","2027-01-05","Sodicentro",{"$f":"INDEX(Fornecedores!$B$2:$B$24,MATCH('CP14.2025'!O11,Fornecedores!$A$2:$A$24,0))","v":501328459},32,"OMNIplus","A.606.980.02.64",14.45,"Folan",{"$f":"INDEX(Fornecedores!$B$2:$B$24,MATCH('CP14.2025'!U11,Fornecedores!$A$2:$A$24,0))","v":503679844},33,"KULGER","48.0003",16.5]
["AMORTECEDOR DIREÇÃO",null,null,"060430782",null,null,"Motorbus",{"$f":"INDEX(Fornecedores!$B$2:$B$24,MATCH('CP14.2025'!G12,Fornecedores!$A$2:$A$24,0))","v":503500992},31,"FEBI","173728",94.56,"2026-01-05","2027-01-05","Motorbus",{"$f":"INDEX(Fornecedores!$B$2:$B$24,MATCH('CP14.2025'!O12,Fornecedores!$A$2:$A$24,0))","v":503500992},32,"SACHS","350872",100.8,"CIVIPARTS",{"$f":"INDEX(Fornecedores!$B$2:$B$24,MATCH('CP14.2025'!U12,Fornecedores!$A$2:$A$24,0))","v":503881317},33,"SACHS","SAC-318103",114.4]
["AMORTECEDOR DIREÇÃO",null,null,"004542940",null,null,"NASACAR",{"$f":"INDEX(Fornecedores!$B$2:$B$24,MATCH('CP14.2025'!G13,Fornecedores!$A$2:$A$24,0))","v":500615250},31,"SEMLASTIK","9220",4.88,"2026-01-05","2027-01-05","Folan",{"$f":"INDEX(Fornecedores!$B$2:$B$24,MATCH('CP14.2025'!O13,Fornecedores!$A$2:$A$24,0))","v":503679844},32,"EASY-LIFT","3676",5.2,"CarClasse",{"$f":"INDEX(Fornecedores!$B$2:$B$24,MATCH('CP14.2025'!U13,Fornecedores!$A$2:$A$24,0))","v":503048852},33,"OMNIplus","A.000.980.70.64",11.36]
["AMORTECEDOR DIREÇÃO",null,null,null,"004547675",null,"CIVIPARTS",{"$f":"INDEX(Fornecedores!$B$2:$B$24,MATCH('CP14.2025'!G14,Fornecedores!$A$2:$A$24,0))","v":503881317},31,"SACHS","SAC-318103",114.4,"2026-01-05","2027-01-05"]
["AMORTECEDOR SUSP.FRENTE","021430095",null,"021410139","080430457",null,"CIVIPARTS",{"$f":"INDEX(Fornecedores!$B$2:$B$24,MATCH('CP14.2025'!G15,Fornecedores!$A$2:$A$24,0))","v":503881317},31,"FEBI","FEB-193472",37.18,"2026-01-05","2027-01-05","CIVIPARTS",{"$f":"INDEX(Fornecedores!$B$2:$B$24,MATCH('CP14.2025'!O15,Fornecedores!$A$2:$A$24,0))","v":503881317},32,"SACHS","SAC-319684",55.37,"Folan",{"$f":"INDEX(Fornecedores!$B$2:$B$24,MATCH('CP14.2025'!U15,Fornecedores!$A$2:$A$24,0))","v":503679844},33,"MAYSAN","99202",60]
["AMORTECEDOR DIREÇÃO","004557815",null,null,null,null,"CarClasse",{"$f":"INDEX(Fornecedores!$B$2:$B$24,MATCH('CP14.2025'!G16,Fornecedores!$A$2:$A$24,0))","v":503048852},31,"OMNIplus","A.410.980.50.64",21.58,"2026-01-05","2027-01-05","Sodicentro",{"$f":"INDEX(Fornecedores!$B$2:$B$24,MATCH('CP14.2025'!O16,Fornecedores!$A$2:$A$24,0))","v":501328459},32,"OMNIplus","A.410.980.50.64",21.99]
["AMORTECEDOR 2º EIXO","038430245",null,null,null,null,"NASACAR",{"$f":"INDEX(Fornecedores!$B$2:$B$24,MATCH('CP14.2025'!G17,Fornecedores!$A$2:$A$24,0))","v":500615250},31,"SACHS","315639",153.47,"2026-01-05","2027-01-05","Motorbus",{"$f":"INDEX(Fornecedores!$B$2:$B$24,MATCH('CP14.2025'!O17,Fornecedores!$A$2:$A$24,0))","v":503500992},32,"SACHS","318049",168.19]
["AMORTECEDOR 3ºEIXO","029420015",null,null,"045430550",null,"EUROPART",{"$f":"INDEX(Fornecedores!$B$2:$B$24,MATCH('CP14.2025'!G18,Fornecedores!$A$2:$A$24,0))","v":503791970},31,"EUROPART","9200001060",36.130000000000003,"2026-01-05","2027-01-05","CIVIPARTS",{"$f":"INDEX(Fornecedores!$B$2:$B$24,MATCH('CP14.2025'!O18,Fornecedores!$A$2:$A$24,0))","v":503881317},32,"FEBI","FEB-20419",36.729999999999997,"CarClasse",{"$f":"INDEX(Fornecedores!$B$2:$B$24,MATCH('CP14.2025'!U18,Fornecedores!$A$2:$A$24,0))","v":503048852},33,"OMNIplus","A.627.326.01.00",62.1]
["AMORTECEDOR 3ºEIXO","028430015",null,null,null,null,"EUROPART",{"$f":"INDEX(Fornecedores!$B$2:$B$24,MATCH('CP14.2025'!G19,Fornecedores!$A$2:$A$24,0))","v":503791970},31,"EUROPART","9200001060",36.130000000000003,"2026-01-05","2027-01-05","CIVIPARTS",{"$f":"INDEX(Fornecedores!$B$2:$B$24,MATCH('CP14.2025'!O19,Fornecedores!$A$2:$A$24,0))","v":503881317},32,"FEBI","FEB-20419",36.729999999999997,"CarClasse",{"$f":"INDEX(Fornecedores!$B$2:$B$24,MATCH('CP14.2025'!U19,Fornecedores!$A$2:$A$24,0))","v":503048852},33,"OMNIplus","A.627.326.01.00",62.1]
["AMORTECEDOR 3ºEIXO","038430203",null,null,null,null,"NASACAR",{"$f":"INDEX(Fornecedores!$B$2:$B$24,MATCH('CP14.2025'!G20,Fornecedores!$A$2:$A$24,0))","v":500615250},31,"SEMLASTIK","21629",43,"2026-01-05","2027-01-05","Motorbus",{"$f":"INDEX(Fornecedores!$B$2:$B$24,MATCH('CP14.2025'!O20,Fornecedores!$A$2:$A$24,0))","v":503500992},32,"SEM RUBBER","21629",48.96,"EUROPART",{"$f":"INDEX(Fornecedores!$B$2:$B$24,MATCH('CP14.2025'!U20,Fornecedores!$A$2:$A$24,0))","v":503791970},33,"SACHS ","317604",102.45]
{"$rows_left_out":28}
{"sheet":"Fornecedores","index":1,"n_rows":24,"n_cols":12,"rows_kept":24,"cut":false,"hidden":false,"merged":[[0,2,0,3],[0,4,0,5],[0,6,0,7],[0,8,0,9],[0,10,0,11]]}
["Nome","NIF","BT",null,"RL",null,"Universo Algarve",null,"Universo Alentejo",null,"Universo Tejo"]
["Motorbus",503500992,22511,16366,22511,8679,22511," 01499",2254," 04363",22511," 22040"]
["NORS",500662860,22511,49365,22511,10004,22511," 39064",2254," 04516",22511," 22998"]
["Folan",503679844,22511,17172,22511,8966,22511," 01276",2254," 02490",22511," 20973"]
["NASACAR",500615250,22511,20082,22511," 06657 ",22511," 00991",2254," 04483",22511," 21677"]
["GLOBALPARTS",509436722,22511,49333,22511," 09997",22511," 01635",22511,49333,22511,49333]
["CBM","B85631083",22512,30052,22511,"09403 ",22512,"09403",22512,"09403",22512," 30371"]
["EUROPART",503791970,22511,16559,22511," 08718",22511,386,2254," 02112",22511," 20639"]
["NEWONEDRIVE",500662860,22511,49365,22511,10004,22511," 39064",2254," 04516",22511," 22998"]
["COPEROL",502021160,22511,15456,22511," 10000",22511," 00293 ",2254," 01504",22511,"20438 "]
["KRAULTI",502271450,22511,20213,22511,"08024",22511,"0017",2254,"03627",22511,21655]
["TECNIAMPER",501948775,22511,14471,22511,"07215 ",22511," 01371",2254,"06210 ",22511," 22155"]
["VID",515324388,22511,10082,22511,10082,22511,10082,22511,10082,22511,10082]
["CarClasse",503048852,"XXXXX","XXXXX","XXXXX","XXXXX","XXXXX","XXXXX","XXXXX","XXXXX","XXXXX","XXXXX"]
["Sodicentro",501328459,"XXXXX","XXXXX","XXXXX","XXXXX","XXXXX","XXXXX","XXXXX","XXXXX","XXXXX","XXXXX"]
["Truck","516853252","XXXXX","XXXXX","XXXXX","XXXXX","XXXXX","XXXXX","XXXXX","XXXXX","XXXXX","XXXXX"]
["CARBUS",503801461,22511,15202,22511," 08654",22511," 03807 ",2254," 01030",22511," 20460"]
["IM",500952981,22511,15049,22511,"08251 ",22511,"00526",2254," 03122",22511," 21114"]
["AGT",501276343,22511,14691,22511," 09870",22511," 03145",2254," 00298",22511," 20120"]
["ATLASBUS","B27739879",22512,48746,22512," 08782",22512,48746,2255," 00102",25112,48746]
{"$rows_left_out":5}
{"sheet":"RefParts II","index":2,"n_rows":175,"n_cols":12,"rows_kept":175,"cut":false,"hidden":false,"merged":[]}
["Ref Acordo","Nome Acordo","Empresa","Descrição Peça","CAE","Fornecedor","CFE","Marca Modelo","VUnit","Acordo","Data I","Data F"]
["CP14.2025.00003","CP14.2025: Amortecedores","BT","AMORTECEDOR SUSP.TRASEIRA","021430103.10","CIVIPARTS","00424.10","DT DIESEL: DTD-4.66580",26.19,"Acordo","2026-01-05","2027-01-05"]
["CP14.2025.00003","CP14.2025: Amortecedores","BT","AMORTECEDOR SUSP.TRASEIRA","021430103.10","Folan","17172.10","MONROE: V1178",33,"Alternativa 1","2026-01-05","2027-01-05"]
["CP14.2025.00003","CP14.2025: Amortecedores","BT","AMORTECEDOR SUSP.TRASEIRA","021430103.10","CIVIPARTS","00424.10","SACHS: SAC-314606",34.31,"Alternativa 2","2026-01-05","2027-01-05"]
["CP14.2025.00005","CP14.2025: Amortecedores","BT","AMORTECEDOR DIREÇÃO","004572558.10","Folan","17172.10","EASY-LIFT: 3204",4.5,"Acordo","2026-01-05","2027-01-05"]
["CP14.2025.00005","CP14.2025: Amortecedores","BT","AMORTECEDOR DIREÇÃO","004572558.10","Motorbus","16366.10","SAMPA: 084,008-01",11.52,"Alternativa 1","2026-01-05","2027-01-05"]
["CP14.2025.00005","CP14.2025: Amortecedores","BT","AMORTECEDOR DIREÇÃO","004572558.10","CarClasse","XXXXX.10","OMNIplus: 8.233.190.000.0",16.21,"Alternativa 2","2026-01-05","2027-01-05"]
["CP14.2025.00006","CP14.2025: Amortecedores","BT","AMORTECEDOR DIREÇÃO","028430023.10","CarClasse","XXXXX.10","OMNIplus: 8.231.371.000.0",68.84,"Acordo","2026-01-05","2027-01-05"]
["CP14.2025.00006","CP14.2025: Amortecedores","BT","AMORTECEDOR DIREÇÃO","028430023.10","Sodicentro","XXXXX.10","OMNIplus: 8.231.371.000.0",69.540000000000006,"Alternativa 1","2026-01-05","2027-01-05"]
["CP14.2025.00006","CP14.2025: Amortecedores","BT","AMORTECEDOR DIREÇÃO","028430023.10","CBM","30052.10","var: d9597660",98.99,"Alternativa 2","2026-01-05","2027-01-05"]
["CP14.2025.00007","CP14.2025: Amortecedores","BT","AMORTECEDOR DIREÇÃO","042430124.10","NASACAR","20082.10","MONROE: B1351",35,"Acordo","2026-01-05","2027-01-05"]
["CP14.2025.00007","CP14.2025: Amortecedores","BT","AMORTECEDOR DIREÇÃO","042430124.10","CIVIPARTS","00424.10","SACHS: SAC-290889",70.540000000000006,"Alternativa 1","2026-01-05","2027-01-05"]
["CP14.2025.00007","CP14.2025: Amortecedores","BT","AMORTECEDOR DIREÇÃO","042430124.10","Motorbus","16366.10","MONROE: B5290",71.040000000000006,"Alternativa 2","2026-01-05","2027-01-05"]
["CP14.2025.00008","CP14.2025: Amortecedores","BT","AMORTECEDOR DIREÇÃO","004558128.10","Folan","17172.10","EASY-LIFT: 3585",6.3,"Acordo","2026-01-05","2027-01-05"]
["CP14.2025.00008","CP14.2025: Amortecedores","BT","AMORTECEDOR DIREÇÃO","004558128.10","CBM","30052.10","STABILUS: 4534DS",8.77,"Alternativa 1","2026-01-05","2027-01-05"]
["CP14.2025.00008","CP14.2025: Amortecedores","BT","AMORTECEDOR DIREÇÃO","004558128.10","CarClasse","XXXXX.10","OMNIplus: A.002.980.30.64",18.079999999999998,"Alternativa 2","2026-01-05","2027-01-05"]
["CP14.2025.00013","CP14.2025: Amortecedores","BT","AMORTECEDOR SUSP.FRENTE","021430095.10","CIVIPARTS","00424.10","FEBI: FEB-193472",37.18,"Acordo","2026-01-05","2027-01-05"]
["CP14.2025.00013","CP14.2025: Amortecedores","BT","AMORTECEDOR SUSP.FRENTE","021430095.10","CIVIPARTS","00424.10","SACHS: SAC-319684",55.37,"Alternativa 1","2026-01-05","2027-01-05"]
["CP14.2025.00013","CP14.2025: Amortecedores","BT","AMORTECEDOR SUSP.FRENTE","021430095.10","Folan","17172.10","MAYSAN: 99202",60,"Alternativa 2","2026-01-05","2027-01-05"]
["CP14.2025.00014","CP14.2025: Amortecedores","BT","AMORTECEDOR DIREÇÃO","004557815.10","CarClasse","XXXXX.10","OMNIplus: A.410.980.50.64",21.58,"Acordo","2026-01-05","2027-01-05"]
{"$rows_left_out":156}
{"sheet":"RefParts","index":3,"n_rows":61,"n_cols":19,"rows_kept":61,"cut":false,"hidden":false,"merged":[]}
["Ref Acordo","Nome Acordo","Empresa","Descrição Peça","CAE","Acodro: Fornecedor","Acordo: CFE","Acordo: Marca Modelo","Acordo: VUnit","Acordo: Data I","Acordo: Data F","Alt1: Fornecedor","Alt1: CFE","Alt1: Marca Modelo","Alt1: VUnit","Alt2: Fornecedor","Alt2: CFE","Alt2: Marca Modelo","Alt2: VUnit"]
["CP14.2025.00003","CP14.2025: Amortecedores","BT","AMORTECEDOR SUSP.TRASEIRA","021430103.10","CIVIPARTS","00424.10","DT DIESEL: DTD-4.66580",26.19,"2026-01-05","2027-01-05","Folan","17172.10","MONROE: V1178",33,"CIVIPARTS","00424.10","SACHS: SAC-314606",34.31]
["CP14.2025.00005","CP14.2025: Amortecedores","BT","AMORTECEDOR DIREÇÃO","004572558.10","Folan","17172.10","EASY-LIFT: 3204",4.5,"2026-01-05","2027-01-05","Motorbus","16366.10","SAMPA: 084,008-01",11.52,"CarClasse","XXXXX.10","OMNIplus: 8.233.190.000.0",16.21]
["CP14.2025.00006","CP14.2025: Amortecedores","BT","AMORTECEDOR DIREÇÃO","028430023.10","CarClasse","XXXXX.10","OMNIplus: 8.231.371.000.0",68.84,"2026-01-05","2027-01-05","Sodicentro","XXXXX.10","OMNIplus: 8.231.371.000.0",69.540000000000006,"CBM","30052.10","var: d9597660",98.99]
["CP14.2025.00007","CP14.2025: Amortecedores","BT","AMORTECEDOR DIREÇÃO","042430124.10","NASACAR","20082.10","MONROE: B1351",35,"2026-01-05","2027-01-05","CIVIPARTS","00424.10","SACHS: SAC-290889",70.540000000000006,"Motorbus","16366.10","MONROE: B5290",71.040000000000006]
["CP14.2025.00008","CP14.2025: Amortecedores","BT","AMORTECEDOR DIREÇÃO","004558128.10","Folan","17172.10","EASY-LIFT: 3585",6.3,"2026-01-05","2027-01-05","CBM","30052.10","STABILUS: 4534DS",8.77,"CarClasse","XXXXX.10","OMNIplus: A.002.980.30.64",18.079999999999998]
["CP14.2025.00013","CP14.2025: Amortecedores","BT","AMORTECEDOR SUSP.FRENTE","021430095.10","CIVIPARTS","00424.10","FEBI: FEB-193472",37.18,"2026-01-05","2027-01-05","CIVIPARTS","00424.10","SACHS: SAC-319684",55.37,"Folan","17172.10","MAYSAN: 99202",60]
["CP14.2025.00014","CP14.2025: Amortecedores","BT","AMORTECEDOR DIREÇÃO","004557815.10","CarClasse","XXXXX.10","OMNIplus: A.410.980.50.64",21.58,"2026-01-05","2027-01-05","Sodicentro","XXXXX.10","OMNIplus: A.410.980.50.64",21.99]
["CP14.2025.00015","CP14.2025: Amortecedores","BT","AMORTECEDOR 2º EIXO","038430245.10","NASACAR","20082.10","SACHS: 315639",153.47,"2026-01-05","2027-01-05","Motorbus","16366.10","SACHS: 318049",168.19]
["CP14.2025.00016","CP14.2025: Amortecedores","BT","AMORTECEDOR 3ºEIXO","029420015.10","EUROPART","16559.10","EUROPART: 9200001060",36.130000000000003,"2026-01-05","2027-01-05","CIVIPARTS","00424.10","FEBI: FEB-20419",36.729999999999997,"CarClasse","XXXXX.10","OMNIplus: A.627.326.01.00",62.1]
["CP14.2025.00017","CP14.2025: Amortecedores","BT","AMORTECEDOR 3ºEIXO","028430015.10","EUROPART","16559.10","EUROPART: 9200001060",36.130000000000003,"2026-01-05","2027-01-05","CIVIPARTS","00424.10","FEBI: FEB-20419",36.729999999999997,"CarClasse","XXXXX.10","OMNIplus: A.627.326.01.00",62.1]
["CP14.2025.00018","CP14.2025: Amortecedores","BT","AMORTECEDOR 3ºEIXO","038430203.10","NASACAR","20082.10","SEMLASTIK: 21629",43,"2026-01-05","2027-01-05","Motorbus","16366.10","SEM RUBBER: 21629",48.96,"EUROPART","16559.10","SACHS : 317604",102.45]
["CP14.2025.00019","CP14.2025: Amortecedores","BT","AMORTECEDOR 3ºEIXO","038430054.10","NASACAR","20082.10","SEMLASTIK: 21629",43,"2026-01-05","2027-01-05","Motorbus","16366.10","SEM RUBBER: 21629",48.96,"EUROPART","16559.10","SACHS : 317604",102.45]
["CP14.2025.00023","CP14.2025: Amortecedores","BT","AMORTECEDOR DIREÇÃO","024230005.10","CIVIPARTS","00424.10","SAMPA: SAM-100.139-01",32.11,"2026-01-05","2027-01-05","Motorbus","16366.10","SAMPA: 100.139",33.6,"NASACAR","20082.10","SEMLASTIK: 11431",35]
["CP14.2025.00024","CP14.2025: Amortecedores","BT","AMORTECEDOR SUSP.FRENTE","027430040.10","NASACAR","20082.10","SEMLASTIK: 14138",35,"2026-01-05","2027-01-05","EUROPART","16559.10","EUROPART: 9202809660",38.36,"CIVIPARTS","00424.10","SAMPA: SAM-100.154",42.06]
["CP14.2025.00025","CP14.2025: Amortecedores","BT","AMORTECEDOR SUSP.FRENTE","065430043.10","NASACAR","20082.10","SEMLASTIK: 14138",35,"2026-01-05","2027-01-05","EUROPART","16559.10","EUROPART: 9202809660",38.36,"CIVIPARTS","00424.10","SAMPA: SAM-100.154",42.06]
["CP14.2025.00027","CP14.2025: Amortecedores","BT","AMORTECEDOR SUSP.FRENTE","038430211.10","NASACAR","20082.10","SEMLASTIK: 21631",45,"2026-01-05","2027-01-05","Motorbus","16366.10","SEM RUBBER: 21631",52.8,"EUROPART","16559.10","KONI: 99B3276",112.7]
["CP14.2025.00028","CP14.2025: Amortecedores","BT","AMORTECEDOR SUSP.FRENTE","052430022.10","Folan","17172.10","EMMERRE: 990142",22,"2026-01-05","2027-01-05","CIVIPARTS","00424.10","DT DIESEL: DTD-7.12545",33.76,"Motorbus","16366.10","MONROE: V2518",41.09]
["CP14.2025.00029","CP14.2025: Amortecedores","BT","AMORTECEDOR SUSP.FRENTE","046430013.10","Motorbus","16366.10","SAMPA: 46,037",58.56,"2026-01-05","2027-01-05","NASACAR","20082.10","KONI: 99B3119",94,"EUROPART","16559.10","SACHS: 131140",96.5]
["CP14.2025.00036","CP14.2025: Amortecedores","BT","AMORTECEDOR RODADO ","029420023.10","CIVIPARTS","00424.10","MONROE: MON-B5302",62.32,"2026-01-05","2027-01-05","Motorbus","16366.10","MONROE: B5302",62.4,"Folan","17172.10","MAYSAN: 99366",81.3]
{"$rows_left_out":42}
{"sheet":"Fornecedores II","index":4,"n_rows":139,"n_cols":4,"rows_kept":139,"cut":false,"hidden":false,"merged":[]}
["Empresa","Nome","CFE","NIF"]
["BT","Motorbus","16366.10",503500992]
["BT","NORS","49365.10",500662860]
["BT","Folan","17172.10",503679844]
["BT","NASACAR","20082.10",500615250]
["BT","GLOBALPARTS","49333.10",509436722]
["BT","CBM","30052.10","B85631083"]
["BT","EUROPART","16559.10",503791970]
["BT","NEWONEDRIVE","49365.10",500662860]
["BT","COPEROL","15456.10",502021160]
["BT","KRAULTI","20213.10",502271450]
["BT","TECNIAMPER","14471.10",501948775]
["BT","VID","10082.10",515324388]
["BT","CarClasse","XXXXX.10",503048852]
["BT","Sodicentro","XXXXX.10",501328459]
["BT","Truck","XXXXX.10",516853252]
["BT","CARBUS","15202.10",503801461]
["BT","IM","15049.10",500952981]
["BT","AGT","14691.10",501276343]
["BT","ATLASBUS","48746.10","B27739879"]
{"$rows_left_out":120}
{"sheet":"Input","index":5,"n_rows":8,"n_cols":8,"rows_kept":8,"cut":false,"hidden":false,"merged":[]}
[]
[null,"Nome Concurso","CP14.2025","Amortecedores"]
[null,"Base Cod. Fornecedores","BT","RL","Universo Algarve","Universo Alentejo","Universo Tejo","Universo Tejo"]
[null,"Empresas","BT","RL","EVA","RA","RT","ROeste"]
[null,"Cod. Empresas",10,16,9,8,4,84]
[null,"Nº Empresas AS400",5,"começa na col","B",{"$f":"COLUMN(INDIRECT(E6&\"1\"))","v":2}]
[null,"Ref. Peças AS400","BT","RL","EVA","RA","TEJO","TEJO"]
[null,"Dimensão Propostas",6,"colunas"]